pic16f690 complier出現錯誤

作者 garyyang 於 2017年09月07日 11:14:51
如題,使用MCU pic16f690 XC8 v1.42 mplabx ide v3.65 編譯後出現以下錯誤,請問如何解決?

nbproject/Makefile-default.mk:114: recipe for target 'build/default/production/106_wallaby_trunk_electronic_locks.p1' failed
make[2]: *** [build/default/production/106_wallaby_trunk_electronic_locks.p1] Error 1
make[2]: *** Waiting for unfinished jobs....
make[2]: Leaving directory 'D:/gary/WORK/mplabx/106_wallaby_trunk_electronic_locks.X'
make[1]: *** [.build-conf] Error 2
nbproject/Makefile-default.mk:90: recipe for target '.build-conf' failed
make[1]: Leaving directory 'D:/gary/WORK/mplabx/106_wallaby_trunk_electronic_locks.X'
nbproject/Makefile-impl.mk:39: recipe for target '.build-impl' failed
make: *** [.build-impl] Error 2

來自: http://www.microchip.com.tw/newbb/viewtopic.php?forum=1&topic_id=21585&post_id=76662